zoukankan      html  css  js  c++  java
  • 编译安装apache2.4.28错误

    很多时候一直以为对编译安装lamp环境轻车熟路,可是每次安装的时候都能出现各种不同的问题。本以为很小的问题,可是百度了一个晚上都没找到答案。

    问题重现:

    编译安装完 apr apr-util 之后,安装httpd-2.4.28的时候报下面的错误,然而

    ./configure --with-apr=/usr/local/apr --with-apr-util=/usr/local/apr-util  --prefix=/usr/local/apache2  --enable-so --enable-ssl --enable-cgi --enable-rewrite --with-zlib --with-pcre  --enable-modules=most --enable-mpms-shared=all

    已经指定了安装路径,还是出错。

    /usr/local/apr-util/lib/libaprutil-1.so: undefined reference to `XML_GetErrorCode'
    /usr/local/apr-util/lib/libaprutil-1.so: undefined reference to `XML_SetEntityDeclHandler'
    /usr/local/apr-util/lib/libaprutil-1.so: undefined reference to `XML_ParserCreate'
    /usr/local/apr-util/lib/libaprutil-1.so: undefined reference to `XML_SetCharacterDataHandler'
    /usr/local/apr-util/lib/libaprutil-1.so: undefined reference to `XML_ParserFree'
    /usr/local/apr-util/lib/libaprutil-1.so: undefined reference to `XML_SetUserData'
    /usr/local/apr-util/lib/libaprutil-1.so: undefined reference to `XML_StopParser'
    /usr/local/apr-util/lib/libaprutil-1.so: undefined reference to `XML_Parse'
    /usr/local/apr-util/lib/libaprutil-1.so: undefined reference to `XML_ErrorString'
    /usr/local/apr-util/lib/libaprutil-1.so: undefined reference to `XML_SetElementHandler'
    collect2: error: ld returned 1 exit status
    make[2]: *** [htpasswd] Error 1
    make[2]: Leaving directory `/usr/local/httpd-2.4.26/support'
    make[1]: *** [all-recursive] Error 1
    make[1]: Leaving directory `/usr/local/httpd-2.4.26/support'
    make: *** [all-recursive] Error 1

    #终于在弯弯的一个论坛找到了答案。原来是apr apr-util 用了最新的1.6版本(之前1.6版本在centos7编译安装apache没有问题)

    降低了版本,用回1.5版本正常解决。

  • 相关阅读:
    fork安全的gettid高效实现
    TCP_DEFER_ACCEPT的坑
    TCP Linger的坑
    Blade和其他构建工具有什么不同
    在Blade中结合gperftools检查内存泄露
    GraphViz web版
    用户场景分析
    java-二维数组——with 刘童格
    java-四则运算-五-网页版--with刘童格
    java-四则运算-四
  • 原文地址:https://www.cnblogs.com/zyos/p/7663717.html
Copyright © 2011-2022 走看看